Repair Cannot Determine Perl Version Info From Lib/dbix/searchbuilder.pm Tutorial

Home > Cannot Determine > Cannot Determine Perl Version Info From Lib/dbix/searchbuilder.pm

Cannot Determine Perl Version Info From Lib/dbix/searchbuilder.pm

Draw some mountain peaks Does The Amazing Lightspeed Horse work, RAW? asked 6 years ago viewed 473 times active 6 years ago Linked 3 Is there a way to avoid putting the Perl version number into the “use lib” line for Perl Why did the best potions master have greasy hair? Ĉu oni estas "en" aŭ "sur" foto? perhaps others but I'm outta here for now. # TueMar1010:30:212015 karres [...] illinois.edu - Correspondence added Subject: RE: [rt.cpan.org #102531] Cannot find the location of RT.pm that defines $RT::LocalPath in RT-Extension-LDAPImport-0.36 his comment is here

mud ! from before... Falling back to other methods to \ determine prerequisites
make[1]: Entering directory \ `/root/.cpan/build/DBD-SQLite-1.14-6O4X44'
cp lib/DBD/SQLite.pm \ blib/lib/DBD/SQLite.pm
/usr/bin/perl5.10.0 -p -e "s/~DRIVER~/SQLite/g" \ /usr/lib/perl5/vendor_perl/5.10.0/i486-linux-thread-multi/auto/DBI/Driver.xst > \ SQLite.xsi
/usr/bin/perl5.10.0 /usr/lib/perl5/5.10.0/ExtUtils/xsubpp -typemap \ /usr/lib/perl5/5.10.0/ExtUtils/typemap SQLite.xs > SQLite.xsc FAILED test 2
Failed 1/2 \ tests, 50.00% okay
t/07busy................dubious \
Test returned status 0 (wstat 11, 0xb)
DIED. read this article

How can I declare independence from the United States and start my own micro nation? Join them; it only takes a minute: Sign up How do I use a dependency on a Perl module installed in a non-standard location? It's not really RT's fault that a dependency module breaks on your particular system, and installing everything via CPAN is the most generic way to go.

  • I have now added UNIVERSAL::require Log::Dispatch Symbol::Global::Name DBIx::SearchBuilder After that list the Makefile.PL ran farther and it discovered that Net::LDAP was missing.
  • Here is the total output: [email protected]:/space/rt-packages/rt-3.8.1# [email protected]:/space/rt-packages/rt-3.8.1# make fixdeps /usr/bin/perl ./sbin/rt-test-dependencies --verbose --install --with-mysql \ --with-fastcgi perl: >=5.8.3(5.10.0)...found users: rt group (apache)...found bin owner (root)...found libs owner (root)...found libs group (bin)...found
  • share|improve this answer edited Jun 18 '10 at 4:20 answered Jun 18 '10 at 3:52 user181548 add a comment| Your Answer draft saved draft discarded Sign up or log in
  • I am trying to install > RT-Extension-LDAPImport-0.36.
  • up vote 3 down vote favorite 1 I need to install two Perl modules on a web host.
  • If a ring R with 1 has characteristic 0.
  • I didn't see the "r: with the ticket number last time...
  • Compilation failed in require.

Let's call them A::B and X::Y. Were the Smurfs the first to smurf their smurfs? Falling back to other methods to determine prerequisites > ---- Unsatisfied dependencies detected during ---- > ---- JESSE/DBIx-SearchBuilder-1.54.tar.gz ---- > DBD::SQLite [requires] > Shall I follow them and prepend them to I have tried using variables like PERL_LIB and LIB on the command line, after PREFIX=..., but nothing I have done seems to work.

I have now successfully run the importer and have at least connected to our AD. ICAL missing dependencies: Data::ICal...MISSING CORE missing dependencies: DBIx::SearchBuilder >= 1.54...MISSING make: *** [fixdeps] Error 1 [email protected]:/space/rt-packages/rt-3.8.1# [Attachment #5 (text/html)]



--- On Tue, 12/30/08, Count trailing truths How did early mathematicians make it without Set theory? click to read more It suggested that there is a missing module.

Writing Makefile for DBIx::SearchBuilder Could not read '/root/.cpan/build/DBIx-SearchBuilder-1.54-mDfU3Y/META.yml'. mail ! Continuing, but chances to succeed are limited. > make[1]: Entering directory `/root/.cpan/build/DBIx-SearchBuilder-1.54-mDfU3Y' > /usr/bin/perl5.10.0 "-Iinc" Makefile.PL --config= --installdeps=DBD::SQLite,0 > Cannot determine perl version info from SearchBuilder.pm > > *** Since we're Files=16, Tests=511, 4 wallclock secs ( 2.42 cusr + 1.55 csys = 3.97 CPU) make[1]: Leaving directory `/root/.cpan/build/DBIx-SearchBuilder-1.54-mDfU3Y' JESSE/DBIx-SearchBuilder-1.54.tar.gz Tests succeeded but one dependency not OK (DBD::SQLite) Warning (usually harmless): 'YAML'

I can do make and make install successfully, but I can't do make test because of this problem. Related 167How is Perl's @INC constructed? (aka What are all the ways of affecting where Perl modules are searched for?)3Is there a way to avoid putting the Perl version number into yahoo ! Does the "bat wing" aircraft paint design have a proper name?

Please report any issues with rt.cpan.org to [email protected] this content I have successfully installed A::B into a non-system location using perl Makefile.PL PREFIX=/non/system/location make; make test; make install Now I want to install X::Y, so I try the same thing perl Files=29, Tests=463, 7 wallclock secs ( 1.48 cusr + 1.45 csys = 2.93 CPU) Failed 2/29 test programs. 5/463 subtests failed. I have tried using the command line cpan tool and downloading and installing by hand.

Falling back to other methods to determine prerequisites > make[1]: Entering directory `/root/.cpan/build/DBD-SQLite-1.14-6O4X44' > cp lib/DBD/SQLite.pm blib/lib/DBD/SQLite.pm > /usr/bin/perl5.10.0 -p -e "s/~DRIVER~/SQLite/g" /usr/lib/perl5/vendor_perl/5.10.0/i486-linux-thread-multi/auto/DBI/Driver.xst > SQLite.xsi > /usr/bin/perl5.10.0 /usr/lib/perl5/5.10.0/ExtUtils/xsubpp -typemap /usr/lib/perl5/5.10.0/ExtUtils/typemap SQLite.xs FAILED tests 5-8 > Failed 4/8 tests, 50.00% okay > t/08create_function.....ok > t/09create_aggregate....ok > t/10dsnlist.............ok > t/11unicode.............ok > t/20createdrop..........ok > t/30insertfetch.........ok > t/40bindparam...........ok > t/40blobs...............ok > t/40blobtext............ok > t/40listfields..........ok > t/40nulls...............ok I get stuck in the > same place each time: What does: /usr/local/bin/perl -I/opt/rt-4.2.10/lib -MRT -e1 ..output? weblink You have new mail in /var/spool/mail/root Suggestions? # ThuMar0512:42:202015 alexmv [...] bestpractical.com - Correspondence added Subject: Re: [rt.cpan.org #102531] Cannot find the location of RT.pm that defines $RT::LocalPath in RT-Extension-LDAPImport-0.36 and

About Welcome anonymous guest. Looks good Using DBI 1.607 (for perl 5.010000 on i486-linux-thread-multi) installed in \ /usr/lib/perl5/vendor_perl/5.10.0/i486-linux-thread-multi/auto/DBI/ Writing Makefile \ for DBD::SQLite Could not read '/root/.cpan/build/DBD-SQLite-1.14-6O4X44/META.yml'. \ Falling back to other methods to determine FAILED tests 5-8
\ Failed 4/8 tests, 50.00% okay
t/08create_function.....ok \
t/09create_aggregate....ok \
t/10dsnlist.............ok \
t/11unicode.............ok \
t/20createdrop..........ok \
t/30insertfetch.........ok \
t/40bindparam...........ok \
t/40blobs...............ok \
t/40blobtext............ok \
t/40listfields..........ok \
t/40nulls...............ok \
t/40numrows.............ok

The --skipdeps option here suppresses a convenient feature/exasperating problem with Module::Install where it tries to use CPAN.pm to download missing modules.

Files=29, Tests=463, 7 wallclock secs ( 1.48 cusr + 1.45 csys = 2.93 CPU) Failed 2/29 test programs. 5/463 subtests failed. Is it acceptable to ask an unknown professor outside my dept for help in a related field during his office hours? FAILED test 2 Failed 1/2 tests, 50.00% okay t/07busy................dubious Test returned status 0 (wstat 11, 0xb) DIED. I have tried using the command line > cpan tool and downloading and installing by hand.

MAILGATE dependencies: Pod::Usage...found HTML::TreeBuilder...found Getopt::Long...found HTML::FormatText...found LWP::UserAgent...found MASON dependencies: Storable >= 2.08...found CSS::Squish >= 0.06...found Apache::Session >= 1.53...found Errno...found Devel::StackTrace >= 1.19...found CGI::Cookie >= 1.20...found Text::WikiFormat >= 0.76...found XML::RSS >= 1.05...found Wait... Interconnectivity How do I change thickness and color of \hline on a table simultaneously؟ How can I check to see if a process is stopped from the command-line? http://inviewsoftware.com/cannot-determine/cannot-determine-perl-version-info-from-lib-net-ssleay-pm.html Report information The Basics Id: 102531 Status: open Priority: 0/ Queue: RT-Extension-LDAPImport People Owner: Nobody in particular Requestors: karres [...] illinois.edu Cc: AdminCc: Bug Information Severity: (no value) Broken in: (no